Target
D(3) dopamine receptor
Ligand
BDBM50073805
Substrate
Meas. Tech.
ChEBML_62138
Ki
5000±n/a nM
Citation
 Löber, SAboul-Fadl, THübner, HGmeiner, P Di- and trisubstituted pyrazolo[1,5-a]pyridine derivatives: synthesis, dopamine receptor binding and ligand efficacy. Bioorg Med Chem Lett 12:633-6 (2002)  
Target
Name:
D(3) dopamine receptor
Synonyms:
DOPAMINE D3 DRD3_HUMAN Dopamine D3 receptor (D3) Dopamine receptor Dopamine receptor D3
Type:
Mol. Mass.:
44243.43
Organism:
Homo sapiens (Human)
Description:
Residue:
400
  
Inhibitor
Name:
BDBM50073805
Synonyms:
3-((4-(4-chlorophenyl)piperazin-1-yl)methyl)H-pyrazolo[1,5-a]pyridine 4-(4-Chloro-phenyl)-1-pyrazolo[1,5-a]pyridin-3-ylmethyl-piperazin-1-ium FAUC 113
Type:
Small organic molecule
Emp. Form.:
C18H19ClN4
Mol. Mass.:
326.823
SMILES:
Clc1ccc(cc1)N1CCN(Cc2cnn3ccccc23)CC1
: