Target
D(1A) dopamine receptor
Ligand
BDBM50073805
Substrate
Meas. Tech.
ChEBML_60335
Ki
12000±n/a nM
Citation
 Löber, SAboul-Fadl, THübner, HGmeiner, P Di- and trisubstituted pyrazolo[1,5-a]pyridine derivatives: synthesis, dopamine receptor binding and ligand efficacy. Bioorg Med Chem Lett 12:633-6 (2002)  
Target
Name:
D(1A) dopamine receptor
Synonyms:
D(1A) dopamine receptor DOPAMINE D1 DRD1_BOVIN | Dopamine receptor
Type:
Enzyme Catalytic Domain
Mol. Mass.:
49330.65
Organism:
BOVINE
Description:
DOPAMINE D1 DRD1 BOVINE::Q95136
Residue:
446
  
Inhibitor
Name:
BDBM50073805
Synonyms:
3-((4-(4-chlorophenyl)piperazin-1-yl)methyl)H-pyrazolo[1,5-a]pyridine 4-(4-Chloro-phenyl)-1-pyrazolo[1,5-a]pyridin-3-ylmethyl-piperazin-1-ium FAUC 113
Type:
Small organic molecule
Emp. Form.:
C18H19ClN4
Mol. Mass.:
326.823
SMILES:
Clc1ccc(cc1)N1CCN(Cc2cnn3ccccc23)CC1
: