Target
D(3) dopamine receptor
Ligand
BDBM50109945
Substrate
Meas. Tech.
ChEBML_62138
Ki
21000±n/a nM
Citation
 Löber, SAboul-Fadl, THübner, HGmeiner, P Di- and trisubstituted pyrazolo[1,5-a]pyridine derivatives: synthesis, dopamine receptor binding and ligand efficacy. Bioorg Med Chem Lett 12:633-6 (2002)  
Target
Name:
D(3) dopamine receptor
Synonyms:
DOPAMINE D3 DRD3_HUMAN Dopamine D3 receptor (D3) Dopamine receptor Dopamine receptor D3
Type:
Mol. Mass.:
44243.43
Organism:
Homo sapiens (Human)
Description:
Residue:
400
  
Inhibitor
Name:
BDBM50109945
Synonyms:
3-[4-(4-Chloro-phenyl)-piperazin-1-ylmethyl]-2-methyl-pyrazolo[1,5-a]pyridine-7-carbonitrile | CHEMBL160932
Type:
Small organic molecule
Emp. Form.:
C20H20ClN5
Mol. Mass.:
365.859
SMILES:
Cc1nn2c(cccc2c1CN1CCN(CC1)c1ccc(Cl)cc1)C#N
: