Target
cAMP-specific 3',5'-cyclic phosphodiesterase 4B
Ligand
BDBM50110035
Substrate
Meas. Tech.
ChEBML_222610
IC50
57±n/a nM
Citation
 Andrés, JIAlonso, JMDíaz, AFernández, JIturrino, LMartínez, PMatesanz, EFreyne, EJDeroose, FBoeckx, GPetit, DDiels, GMegens, ASomers, MVan Wauwe, JStoppie, PCools, MDe Clerck, FPeeters, Dde Chaffoy, D Synthesis and biological evaluation of imidazol-2-one and 2-cyanoiminoimidazole derivatives: novel series of PDE4 inhibitors. Bioorg Med Chem Lett 12:653-8 (2002)  
Target
Name:
cAMP-specific 3',5'-cyclic phosphodiesterase 4B
Synonyms:
3',5'-cyclic phosphodiesterase Isoform PDE4B1 PDE4B PDE4B_HUMAN Phosphodiesterase 4B (PDE4B) Phosphodiesterase Type 4 (PDE4B)
Type:
Protein
Mol. Mass.:
83318.87
Organism:
Homo sapiens (Human)
Description:
Q07343
Residue:
736
  
Inhibitor
Name:
BDBM50110035
Synonyms:
1-[2-(3-Cyclopropylmethoxy-4-methoxy-phenyl)-propyl]-1,3-dihydro-imidazol-2-ylidene-cyanamide | CHEMBL345877
Type:
Small organic molecule
Emp. Form.:
C18H22N4O2
Mol. Mass.:
326.3929
SMILES:
COc1ccc(cc1OCC1CC1)C(C)Cn1ccnc1NC#N
: