Target
Prothrombin
Ligand
BDBM50111110
Substrate
Meas. Tech.
ChEBML_208337
Ki
0.003000±n/a nM
Citation
 Lee, KJung, WHPark, CWPark, HDLee, SHKwon, OH Noncovalent tripeptidic thrombin inhibitors incorporating amidrazone, amine and amidine functions at P1. Bioorg Med Chem Lett 12:1017-22 (2002)  
Target
Name:
Prothrombin
Synonyms:
Activation peptide fragment 1 Coagulation factor II Prothrombin precursor Thrombin heavy chain | Thrombin light chain
Type:
Protein
Mol. Mass.:
70029.57
Organism:
Homo sapiens (Human)
Description:
P00734
Residue:
622
  
Inhibitor
Name:
BDBM50111110
Synonyms:
2N-(4-Benzamidinemethyl)-1-[2-aminosulfonamido-3,3-diphenyl-(2R)-propanoyl]-(2S)-tetrahydro-1H-2-pyrrolecarboxamide;TFA | CHEMBL331771
Type:
Small organic molecule
Emp. Form.:
C28H32N6O4S
Mol. Mass.:
548.656
SMILES:
NC(=N)c1ccc(CNC(=O)[C@@H]2CCCN2C(=O)[C@H](NS(N)(=O)=O)C(c2ccccc2)c2ccccc2)cc1
: