Target
Melanocyte-stimulating hormone receptor
Ligand
BDBM50111186
Substrate
Meas. Tech.
ChEBML_105842
Ki
>1000±n/a nM
Citation
 Mutulis, FMutule, IWikberg, JE N-alkylaminoacids and their derivatives interact with melanocortin receptors. Bioorg Med Chem Lett 12:1039-42 (2002)  
Target
Name:
Melanocyte-stimulating hormone receptor
Synonyms:
MC1-R MSH-R MSHR_HUMAN Melanocortin receptor (M1 and M4) Melanocortin receptor 1 (MC1-R) | Melanocortin receptor 1 (MC1R)
Type:
Enzyme
Mol. Mass.:
34717.23
Organism:
Homo sapiens (Human)
Description:
Q01726
Residue:
317
  
Inhibitor
Name:
BDBM50111186
Synonyms:
(S)-2-Benzylamino-5-guanidino-pentanoic acid amide MK-27
Type:
Small organic molecule
Emp. Form.:
C13H21N5O
Mol. Mass.:
263.3387
SMILES:
NC(=N)NCCC[C@H](NCc1ccccc1)C(N)=O
: