Target
Steryl-sulfatase
Ligand
BDBM50098109
Substrate
Meas. Tech.
ChEBML_68022
IC50
120000±n/a nM
Citation
 Ahmed, SJames, KOwen, CPPatel, CKSampson, L The mechanism of the irreversible inhibition of estrone sulfatase (ES) through the consideration of a range of methane- and amino-sulfonate-based compounds. Bioorg Med Chem Lett 12:1279-82 (2002)  
Target
Name:
Steryl-sulfatase
Synonyms:
ARSC1 Arylsulfatase C STS_HUMAN Steryl-sulfate sulfohydrolase
Type:
Enzyme
Mol. Mass.:
65503.66
Organism:
Homo sapiens (Human)
Description:
P08842
Residue:
583
  
Inhibitor
Name:
BDBM50098109
Synonyms:
3-nitrophenyl sulfamate Sulfamic acid 3-nitro-phenyl ester
Type:
Small organic molecule
Emp. Form.:
C6H6N2O5S
Mol. Mass.:
218.187
SMILES:
NS(=O)(=O)Oc1cccc(c1)[N+]([O-])=O
: