Target
Steryl-sulfatase
Ligand
BDBM50098108
Substrate
Meas. Tech.
ChEBML_68022
IC50
912000±n/a nM
Citation
 Ahmed, SJames, KOwen, CPPatel, CKSampson, L The mechanism of the irreversible inhibition of estrone sulfatase (ES) through the consideration of a range of methane- and amino-sulfonate-based compounds. Bioorg Med Chem Lett 12:1279-82 (2002)  
Target
Name:
Steryl-sulfatase
Synonyms:
ARSC1 Arylsulfatase C STS_HUMAN Steryl-sulfate sulfohydrolase
Type:
Enzyme
Mol. Mass.:
65503.66
Organism:
Homo sapiens (Human)
Description:
P08842
Residue:
583
  
Inhibitor
Name:
BDBM50098108
Synonyms:
CHEMBL283121 | Sulfamic acid 4-bromo-phenyl ester
Type:
Small organic molecule
Emp. Form.:
C6H6BrNO3S
Mol. Mass.:
252.086
SMILES:
NS(=O)(=O)Oc1ccc(Br)cc1
: