Target
Progesterone receptor
Ligand
BDBM50129173
Substrate
Meas. Tech.
ChEMBL_159553 (CHEMBL765841)
Ki
45±n/a nM
Citation
 Zhi, LRinggenberg, JDEdwards, JPTegley, CMWest, SJPio, BMotamedi, MJones, TKMarschke, KBMais, DESchrader, WT Development of progesterone receptor antagonists from 1,2-dihydrochromeno[3,4-f]quinoline agonist pharmacophore. Bioorg Med Chem Lett 13:2075-8 (2003)  
Target
Name:
Progesterone receptor
Synonyms:
NR3C3 PGR PRGR_HUMAN | progesterone
Type:
Protein
Mol. Mass.:
98979.52
Organism:
Homo sapiens (Human)
Description:
P06401
Residue:
933
  
Inhibitor
Name:
BDBM50129173
Synonyms:
7,9-Difluoro-2,2,4-trimethyl-2,3,4,5-tetrahydro-1H-6-oxa-1-aza-chrysene | CHEMBL63788
Type:
Small organic molecule
Emp. Form.:
C19H19F2NO
Mol. Mass.:
315.3571
SMILES:
CC1CC(C)(C)Nc2ccc-3c(COc4c(F)cc(F)cc-34)c12
: