Target
Neutrophil collagenase
Ligand
BDBM50129986
Substrate
Meas. Tech.
ChEBML_105210
IC50
0.560000±n/a nM
Citation
 Reiter, LAMitchell, PGMartinelli, GJLopresti-Morrow, LLYocum, SAEskra, JD Phosphinic acid-based MMP-13 inhibitors that spare MMP-1 and MMP-3. Bioorg Med Chem Lett 13:2331-6 (2003)  
Target
Name:
Neutrophil collagenase
Synonyms:
CLG1 MMP8 Matrix metalloproteinase-8 PMNL collagenase | PMNL-CL
Type:
Enzyme
Mol. Mass.:
53413.48
Organism:
Homo sapiens (Human)
Description:
P22894
Residue:
467
  
Inhibitor
Name:
BDBM50129986
Synonyms:
(4-Benzyl-benzyl)-[4-(4-chloro-phenyl)-2-((S)-2,2-dimethyl-1-methylcarbamoyl-propylcarbamoyl)-butyl]-phosphinic acid CHEMBL77163
Type:
Small organic molecule
Emp. Form.:
C32H40ClN2O4P
Mol. Mass.:
583.098
SMILES:
CNC(=O)[C@@H](NC(=O)C(CCc1ccc(Cl)cc1)CP(O)(=O)Cc1ccc(Cc2ccccc2)cc1)C(C)(C)C
: