Target
Melanocortin receptor 4
Ligand
BDBM50130009
Substrate
Meas. Tech.
ChEMBL_106195 (CHEMBL714613)
EC50
0.170000±n/a nM
Citation
 Fotsch, CSmith, DMAdams, JACheetham, JCroghan, MDoherty, EMHale, CJarosinski, MAKelly, MGNorman, MHTamayo, NAXi, NBaumgartner, JW Design of a new peptidomimetic agonist for the melanocortin receptors based on the solution structure of the peptide ligand, Ac-Nle-cyclo[Asp-Pro-DPhe-Arg-Trp-Lys]-NH(2). Bioorg Med Chem Lett 13:2337-40 (2003)  
Target
Name:
Melanocortin receptor 4
Synonyms:
MC4-R MC4R_HUMAN Melanocortin receptor 4 (MC-4) Melanocortin receptor 4 (MC4R)
Type:
Enzyme
Mol. Mass.:
36949.50
Organism:
Homo sapiens (Human)
Description:
P32245
Residue:
332
  
Inhibitor
Name:
BDBM50130009
Synonyms:
(4S,15R,18S,21S,24S)-5-((S)-2-Acetylamino-hexanoylamino)-22-benzyl-19-(3-guanidino-propyl)-16-(1H-indol-3-ylmethyl)-4,7,15,18,21,24-hexaoxo-tetracosahydro-3a,8,14,17,20,23-hexaaza-cyclopentacyclotricosene-13-carboxylic acid amide | CHEMBL217305
Type:
Small organic molecule
Emp. Form.:
C49H69N13O9
Mol. Mass.:
984.1539
SMILES:
CCCC[C@H](NC(C)=O)C(=O)N[C@H]1CC(=O)NCCCC[C@@H](NC(=O)[C@@H](Cc2c[nH]c3ccccc23)NC(=O)[C@H](CCCNC(N)=N)NC(=O)[C@H](Cc2ccccc2)NC(=O)[C@@H]2CCCN2C1=O)C(N)=O
: