Target
Cytochrome P450 1A2
Ligand
BDBM50131049
Substrate
Meas. Tech.
ChEBML_51362
IC50
1980±n/a nM
Citation
 Don, MJLewis, DFWang, SYTsai, MWUeng, YF Effect of structural modification on the inhibitory selectivity of rutaecarpine derivatives on human CYP1A1, CYP1A2, and CYP1B1. Bioorg Med Chem Lett 13:2535-8 (2003)  
Target
Name:
Cytochrome P450 1A2
Synonyms:
CP1A2_HUMAN CYPIA2 Cytochrome P(3)450 Cytochrome P450 1A2 (CYP1A2) Cytochrome P450-P3
Type:
Enzyme
Mol. Mass.:
58423.38
Organism:
Homo sapiens (Human)
Description:
P05177
Residue:
516
  
Inhibitor
Name:
BDBM50131049
Synonyms:
11-Methoxy-8,13-dihydro-7H-indolo[2',3':3,4]pyrido[2,1-b]quinazolin-5-one | CHEMBL312149
Type:
Small organic molecule
Emp. Form.:
C19H15N3O2
Mol. Mass.:
317.3413
SMILES:
COc1ccc2c3CCn4c(nc5ccccc5c4=O)-c3[nH]c2c1
: