Target
Cytochrome P450 1A1
Ligand
BDBM50131044
Substrate
Meas. Tech.
ChEBML_51347
IC50
32±n/a nM
Citation
 Don, MJLewis, DFWang, SYTsai, MWUeng, YF Effect of structural modification on the inhibitory selectivity of rutaecarpine derivatives on human CYP1A1, CYP1A2, and CYP1B1. Bioorg Med Chem Lett 13:2535-8 (2003)  
Target
Name:
Cytochrome P450 1A1
Synonyms:
CP1A1_HUMAN CYPIA1 Cytochrome P450 1A1 P450 form 6 P450-P1
Type:
Protein
Mol. Mass.:
58177.23
Organism:
Homo sapiens (Human)
Description:
P04798
Residue:
512
  
Inhibitor
Name:
BDBM50131044
Synonyms:
13H-Indolo[2',3':3,4]pyrido[2,1-b]quinazolin-5-one | CHEMBL413956
Type:
Small organic molecule
Emp. Form.:
C18H11N3O
Mol. Mass.:
285.2994
SMILES:
O=c1c2ccccc2[nH]c2c3nc4ccccc4c3ccn12
: