Target
Prothrombin
Ligand
BDBM50131479
Substrate
Meas. Tech.
ChEBML_208517
Ki
0.310000±n/a nM
Citation
 Nantermet, PGBarrow, JCNewton, CLPellicore, JMYoung, MLewis, SDLucas, BJKrueger, JAMcMasters, DRYan, YKuo, LCVacca, JPSelnick, HG Design and synthesis of potent and selective macrocyclic thrombin inhibitors. Bioorg Med Chem Lett 13:2781-4 (2003)  
Target
Name:
Prothrombin
Synonyms:
Activation peptide fragment 1 Coagulation factor II Prothrombin precursor Thrombin heavy chain | Thrombin light chain
Type:
Protein
Mol. Mass.:
70029.57
Organism:
Homo sapiens (Human)
Description:
P00734
Residue:
622
  
Inhibitor
Name:
BDBM50131479
Synonyms:
(S)-1-[(S)-3-Cyclohexyl-3-(diethylcarbamoylmethyl-amino)-propionyl]-pyrrolidine-2-carboxylic acid 2,5-dichloro-benzylamide | CHEMBL330560
Type:
Small organic molecule
Emp. Form.:
C26H38Cl2N4O3
Mol. Mass.:
525.511
SMILES:
CCN(CC)C(=O)CN[C@@H](C1CCCCC1)C(=O)N1CCC[C@H]1C(=O)NCc1cc(Cl)ccc1Cl
: