Target
Carbonic anhydrase 2
Ligand
BDBM10886
Substrate
Meas. Tech.
ChEBML_45085
Ki
9±n/a nM
Citation
 Casini, AScozzafava, AMincione, FMenabuoni, LStarnotti, MSupuran, CT Carbonic anhydrase inhibitors: topically acting antiglaucoma sulfonamides incorporating esters and amides of 3- and 4-carboxybenzolamide. Bioorg Med Chem Lett 13:2867-73 (2003)  
Target
Name:
Carbonic anhydrase 2
Synonyms:
CA-II CAC Carbonate dehydratase II Carbonic anhydrase 2 (CA-II) Carbonic anhydrase C Carbonic anhydrase II (CA-II) Carbonic anhydrase II (hCA II) | Carbonic anhydrase isoenzyme II (hCA II)
Type:
Enzyme
Mol. Mass.:
29250.71
Organism:
Homo sapiens (Human)
Description:
P00918
Residue:
260
  
Inhibitor
Name:
BDBM10886
Synonyms:
2-N-benzene-1,3,4-thiadiazole-2,5-disulfonamide Benzolamide CHEMBL73962
Type:
Small organic molecule
Emp. Form.:
C8H8N4O4S3
Mol. Mass.:
320.369
SMILES:
NS(=O)(=O)c1nnc(NS(=O)(=O)c2ccccc2)s1
: