Target
Thymidylate kinase
Ligand
BDBM50132305
Substrate
Meas. Tech.
ChEBML_208218
Ki
7000±n/a nM
Citation
 Vanheusden, VVan Rompaey, PMunier-Lehmann, HPochet, SHerdewijn, PVan Calenbergh, S Thymidine and thymidine-5'-O-monophosphate analogues as inhibitors of Mycobacterium tuberculosis thymidylate kinase. Bioorg Med Chem Lett 13:3045-8 (2003)  
Target
Name:
Thymidylate kinase
Synonyms:
KTHY_MYCTU Thymidine monophosphate kinase tmk
Type:
PROTEIN
Mol. Mass.:
22636.29
Organism:
Mycobacterium tuberculosis
Description:
ChEMBL_208218
Residue:
214
  
Inhibitor
Name:
BDBM50132305
Synonyms:
1-((2R,4S,5R)-5-(azidomethyl)-4-hydroxy-tetrahydrofuran-2-yl)-5-methylpyrimidine-2,4(1H,3H)-dione CHEMBL102425
Type:
Small organic molecule
Emp. Form.:
C10H13N5O4
Mol. Mass.:
267.2413
SMILES:
Cc1cn([C@H]2C[C@H](O)[C@@H](CN=[N+]=[N-])O2)c(=O)[nH]c1=O
: