Target
Low affinity immunoglobulin epsilon Fc receptor
Ligand
BDBM50132432
Substrate
Meas. Tech.
ChEBML_163803
EC50
1940±n/a nM
Citation
 Lai, JYCox, PJPatel, RSadiq, SAldous, DJThurairatnam, SSmith, KWheeler, DJagpal, SParveen, SFenton, GHarrison, TKMcCarthy, CBamborough, P Potent small molecule inhibitors of spleen tyrosine kinase (Syk). Bioorg Med Chem Lett 13:3111-4 (2003)  
Target
Name:
Low affinity immunoglobulin epsilon Fc receptor
Synonyms:
BLAST-2 CD_antigen=CD23 FCE2 FCER2_HUMAN IGEBF Immunoglobulin epsilon Fc receptor Low affinity immunoglobulin epsilon Fc receptor membrane-bound form Lymphocyte IgE receptor
Type:
PROTEIN
Mol. Mass.:
36461.84
Organism:
Homo sapiens (Human)
Description:
ChEMBL_88888
Residue:
321
  
Inhibitor
Name:
BDBM50132432
Synonyms:
2-(3-((5-methoxy-1-methyl-1H-indol-3-yl)methylene)-2-oxoindoline-5-sulfonamido)acetic acid {3-[1-(5-Methoxy-1-methyl-1H-indol-3-yl)-meth-(Z)-ylidene]-2-oxo-2,3-dihydro-1H-indole-5-sulfonylamino}-acetic acid
Type:
Small organic molecule
Emp. Form.:
C21H19N3O6S
Mol. Mass.:
441.457
SMILES:
COc1ccc2n(C)cc(\C=C3/C(=O)Nc4ccc(cc34)S(=O)(=O)NCC(O)=O)c2c1
: