Target
Low affinity immunoglobulin epsilon Fc receptor
Ligand
BDBM50132455
Substrate
Meas. Tech.
ChEBML_163803
EC50
>10000±n/a nM
Citation
 Lai, JYCox, PJPatel, RSadiq, SAldous, DJThurairatnam, SSmith, KWheeler, DJagpal, SParveen, SFenton, GHarrison, TKMcCarthy, CBamborough, P Potent small molecule inhibitors of spleen tyrosine kinase (Syk). Bioorg Med Chem Lett 13:3111-4 (2003)  
Target
Name:
Low affinity immunoglobulin epsilon Fc receptor
Synonyms:
BLAST-2 CD_antigen=CD23 FCE2 FCER2_HUMAN IGEBF Immunoglobulin epsilon Fc receptor Low affinity immunoglobulin epsilon Fc receptor membrane-bound form Lymphocyte IgE receptor
Type:
PROTEIN
Mol. Mass.:
36461.84
Organism:
Homo sapiens (Human)
Description:
ChEMBL_88888
Residue:
321
  
Inhibitor
Name:
BDBM50132455
Synonyms:
3-[1-(5-Methoxy-1-methyl-1H-indol-3-yl)-meth-(Z)-ylidene]-2-oxo-2,3-dihydro-1H-indole-5-sulfonic acid dimethylamide | CHEMBL322153
Type:
Small organic molecule
Emp. Form.:
C21H21N3O4S
Mol. Mass.:
411.474
SMILES:
COc1ccc2n(C)cc(\C=C3/C(=O)Nc4ccc(cc34)S(=O)(=O)N(C)C)c2c1
: