Target
Peroxisome proliferator-activated receptor alpha
Ligand
BDBM50132564
Substrate
Meas. Tech.
ChEMBL_153543 (CHEMBL766084)
Ki
23±n/a nM
Citation
 Adams, ADHu, Zvon Langen, DDadiz, AElbrecht, AMacNaul, KLBerger, JPZhou, GDoebber, TWMeurer, RForrest, MJMoller, DEJones, AB O-arylmandelic acids as highly selective human PPAR alpha/gamma agonists. Bioorg Med Chem Lett 13:3185-90 (2003)  
Target
Name:
Peroxisome proliferator-activated receptor alpha
Synonyms:
NR1C1 PPAR PPAR-alpha PPARA_HUMAN Peroxisome proliferator-activated receptor | Peroxisome proliferator-activated receptor alpha (PPAR alpha)
Type:
Enzyme
Mol. Mass.:
52222.08
Organism:
Homo sapiens (Human)
Description:
Q07869
Residue:
468
  
Inhibitor
Name:
BDBM50132564
Synonyms:
(5,7-Dipropyl-3-trifluoromethyl-benzo[d]isoxazol-6-yloxy)-(4-trifluoromethyl-phenyl)-acetic acid | CHEMBL110295
Type:
Small organic molecule
Emp. Form.:
C23H21F6NO4
Mol. Mass.:
489.4076
SMILES:
CCCc1cc2c(noc2c(CCC)c1OC(C(O)=O)c1ccc(cc1)C(F)(F)F)C(F)(F)F
: