Target
Sodium-dependent dopamine transporter
Ligand
BDBM50366567
Substrate
Meas. Tech.
ChEBML_62496
Ki
1451±n/a nM
Citation
 Zhou, JKläss, TZhang, AJohnson, KMWang, CZYe, YKozikowski, AP Synthesis and pharmacological evaluation of (Z)-9-(heteroarylmethylene)-7-azatricyclo[4.3.1.0(3,7)]decanes: thiophene analogues as potent norepinephrine transporter inhibitors. Bioorg Med Chem Lett 13:3565-9 (2003)  
Target
Name:
Sodium-dependent dopamine transporter
Synonyms:
DA transporter SC6A3_RAT Sodium-dependent dopamine transporter | Sodium-dependent dopamine transporter (DAT)
Type:
Multi-pass membrane protein
Mol. Mass.:
68749.45
Organism:
Rattus norvegicus (rat)
Description:
P23977
Residue:
619
  
Inhibitor
Name:
BDBM50366567
Synonyms:
ATOMOXETINE
Type:
Small organic molecule
Emp. Form.:
C17H21NO
Mol. Mass.:
255.3547
SMILES:
CNCC[C@@H](Oc1ccccc1C)c1ccccc1
: