Target
Reverse transcriptase/RNaseH
Ligand
BDBM50136474
Substrate
Meas. Tech.
ChEBML_195221
IC50
81±n/a nM
Citation
 Evers, MBarrière, JCBashiardes, GBousseau, ACarry, JCDereu, NFiloche, BHenin, YSablé, SVuilhorgne, MMignani, S Synthesis of non-immunosuppressive cyclophilin-Binding cyclosporin A derivatives as potential anti-HIV-1 drugs. Bioorg Med Chem Lett 13:4415-9 (2003)  
Target
Name:
Reverse transcriptase/RNaseH
Synonyms:
HIV-1 Reverse Transcriptase RNase H Reverse transcriptase/RNaseH
Type:
PROTEIN
Mol. Mass.:
65229.15
Organism:
Human immunodeficiency virus 1
Description:
ChEMBL_1473730
Residue:
566
  
Inhibitor
Name:
BDBM50136474
Synonyms:
CHEMBL3038092 | Cyclosporin A analogue
Type:
Small organic molecule
Emp. Form.:
C67H117N13O12S
Mol. Mass.:
1328.791
SMILES:
CC[C@@H]1NC(=O)[C@H]([C@H](O)[C@H](C)C\C=C\C)N(C)C(=O)[C@H](C(C)C)N(C)C(=O)[C@H](CC(C)C)N(C)C(=O)[C@H](CC(C)C)N(C)C(=O)[C@@H](C)NC(=O)[C@H](C)NC(=O)[C@H](CC(C)C)N(C)C(=O)[C@@H](NC(=O)[C@H](CC(C)C)N(C)C(=O)[C@@H](SCCn2ccnc2)N(C)C1=O)C(C)C
: