Target
Peptidyl-prolyl cis-trans isomerase A
Ligand
BDBM50136482
Substrate
Meas. Tech.
ChEBML_92658
IC50
128±n/a nM
Citation
 Evers, MBarrière, JCBashiardes, GBousseau, ACarry, JCDereu, NFiloche, BHenin, YSablé, SVuilhorgne, MMignani, S Synthesis of non-immunosuppressive cyclophilin-Binding cyclosporin A derivatives as potential anti-HIV-1 drugs. Bioorg Med Chem Lett 13:4415-9 (2003)  
Target
Name:
Peptidyl-prolyl cis-trans isomerase A
Synonyms:
CYPA Cyclophilin A PPIA PPIase A Rotamase A
Type:
Protein
Mol. Mass.:
18015.32
Organism:
Homo sapiens (Human)
Description:
P62937
Residue:
165
  
Inhibitor
Name:
BDBM50136482
Synonyms:
CHEMBL3038093 | Cyclosporin A analogue
Type:
Small organic molecule
Emp. Form.:
C68H122N12O13S
Mol. Mass.:
1347.834
SMILES:
CC[C@@H]1NC(=O)[C@H]([C@H](O)[C@H](C)C\C=C\C)N(C)C(=O)[C@H](C(C)C)N(C)C(=O)[C@H](CC(C)C)N(C)C(=O)[C@H](CC(C)C)N(C)C(=O)[C@@H](C)NC(=O)[C@H](C)NC(=O)[C@H](CC(C)C)N(C)C(=O)[C@@H](NC(=O)[C@H](CC(C)C)N(C)C(=O)[C@@H](SCCN2CCOCC2)N(C)C1=O)C(C)C
: