Target
Coagulation factor X
Ligand
BDBM50421638
Substrate
Meas. Tech.
ChEBML_69660
Kd
2000±n/a nM
Citation
 Gunnarsson, GTDesai, UR Exploring new non-sugar sulfated molecules as activators of antithrombin. Bioorg Med Chem Lett 13:679-83 (2003)  
Target
Name:
Coagulation factor X
Synonyms:
Activated coagulation factor X (FXa) Coagulation factor X precursor F10 Factor X heavy chain Factor Xa Stuart-Prower factor
Type:
Enzyme
Mol. Mass.:
54726.60
Organism:
Homo sapiens (Human)
Description:
Residue:
488
  
Inhibitor
Name:
BDBM50421638
Synonyms:
CHEMBL2303825
Type:
Small organic molecule
Emp. Form.:
C19H34N2O30S5
Mol. Mass.:
930.794
SMILES:
CO[C@H]1O[C@H](COS(O)(=O)=O)[C@@H](O[C@@H]2O[C@@H]([C@@H](O[C@H]3O[C@H](COS(O)(=O)=O)[C@@H](O)[C@H](O)[C@H]3NS(O)(=O)=O)[C@H](O)[C@H]2O)C(O)=O)[C@H](OS(O)(=O)=O)[C@H]1NS(O)(=O)=O
: