Target
Carbonic anhydrase 4
Ligand
BDBM50124185
Substrate
Meas. Tech.
ChEBML_45267
Ki
46000±n/a nM
Citation
 Casini, AAntel, JAbbate, FScozzafava, ADavid, SWaldeck, HSchäfer, SSupuran, CT Carbonic anhydrase inhibitors: SAR and X-ray crystallographic study for the interaction of sugar sulfamates/sulfamides with isozymes I, II and IV. Bioorg Med Chem Lett 13:841-5 (2003)  
Target
Name:
Carbonic anhydrase 4
Synonyms:
CA-IV CAH4_BOVIN Carbonic Anhydrase IV Carbonic anhydrase 4
Type:
Enzyme
Mol. Mass.:
35152.74
Organism:
Bos taurus (bovine)
Description:
Bovine isozyme, isolated from lung microsomes
Residue:
312
  
Inhibitor
Name:
BDBM50124185
Synonyms:
(3aS,5R,5aS,8aR,8bS)-N-(aminosulfonyl)-2,2,7,7-tetramethyltetrahydro-3aH-bis[1,3]dioxolo[4,5-b:4',5'-d]pyran-5-carboxamide | CHEMBL168447
Type:
Small organic molecule
Emp. Form.:
C12H20N2O8S
Mol. Mass.:
352.361
SMILES:
CC1(C)O[C@@H]2O[C@H]([C@H]3OC(C)(C)O[C@H]3[C@@H]2O1)C(=O)NS(N)(=O)=O
: