Target
Carbonic anhydrase 4
Ligand
BDBM50125192
Substrate
Meas. Tech.
ChEBML_45423
Ki
438±n/a nM
Citation
 Vullo, DFranchi, MGallori, EPastorek, JScozzafava, APastorekova, SSupuran, CT Carbonic anhydrase inhibitors: inhibition of the tumor-associated isozyme IX with aromatic and heterocyclic sulfonamides. Bioorg Med Chem Lett 13:1005-9 (2003)  
Target
Name:
Carbonic anhydrase 4
Synonyms:
CA-IV CAH4_BOVIN Carbonic Anhydrase IV Carbonic anhydrase 4
Type:
Enzyme
Mol. Mass.:
35152.74
Organism:
Bos taurus (bovine)
Description:
Bovine isozyme, isolated from lung microsomes
Residue:
312
  
Inhibitor
Name:
BDBM50125192
Synonyms:
CHEMBL6648 naphthalene-1-sulfonamide
Type:
Small organic molecule
Emp. Form.:
C10H9NO2S
Mol. Mass.:
207.249
SMILES:
NS(=O)(=O)c1cccc2ccccc12
: