Target
Carbonic anhydrase 9
Ligand
BDBM50094392
Substrate
Meas. Tech.
ChEBML_45440
Ki
29±n/a nM
Citation
 Abbate, FCasini, AOwa, TScozzafava, ASupuran, CT Carbonic anhydrase inhibitors: E7070, a sulfonamide anticancer agent, potently inhibits cytosolic isozymes I and II, and transmembrane, tumor-associated isozyme IX. Bioorg Med Chem Lett 14:217-23 (2003)  
Target
Name:
Carbonic anhydrase 9
Synonyms:
CA-IX CAH9_HUMAN Carbonic anhydrase 9 (CA IX) Carbonic anhydrase 9 precursor Carbonic anhydrase IX (CAIX) Carbonic anhydrases; II & IX MN RCC-associated antigen G250
Type:
Enzyme
Mol. Mass.:
49669.03
Organism:
Homo sapiens (Human)
Description:
Catalytic domain of human cloned isozyme was used in the assay
Residue:
459
  
Inhibitor
Name:
BDBM50094392
Synonyms:
2,3,4,5,6-Pentafluoro-N-(3-methyl-5-sulfamoyl-3H-[1,3,4]thiadiazol-2-ylidene)-benzamide CHEMBL69149
Type:
Small organic molecule
Emp. Form.:
C10H5F5N4O3S2
Mol. Mass.:
388.294
SMILES:
Cn1nc(s\c1=N\C(=O)c1c(F)c(F)c(F)c(F)c1F)S(N)(=O)=O
: