Target
Sodium- and chloride-dependent creatine transporter 1
Ligand
BDBM50147105
Substrate
Meas. Tech.
ChEBML_49277
Ki
>10000000±n/a nM
Citation
 Geldenhuys, WJLockman, PRMcAfee, JHFitzpatrick, KTVan der Schyf, CJAllen, DD Molecular modeling studies on the active binding site of the blood-brain barrier choline transporter. Bioorg Med Chem Lett 14:3085-92 (2004)  
Target
Name:
Sodium- and chloride-dependent creatine transporter 1
Synonyms:
CHOT1 Creatine transporter SC6A8_RAT Sodium- and chloride-dependent creatine transporter 1 | Solute carrier family 6 member 8
Type:
PROTEIN
Mol. Mass.:
70632.63
Organism:
Rattus norvegicus
Description:
ChEMBL_49276
Residue:
635
  
Inhibitor
Name:
BDBM50147105
Synonyms:
(4-Hydroxy-butyl)-trimethyl-ammonium CHEMBL1209423
Type:
Small organic molecule
Emp. Form.:
C7H18NO
Mol. Mass.:
132.2234
SMILES:
C[N+](C)(C)CCCCO
: