Target
Sodium- and chloride-dependent creatine transporter 1
Ligand
BDBM50147110
Substrate
Meas. Tech.
ChEBML_49277
Ki
4698000±n/a nM
Citation
 Geldenhuys, WJLockman, PRMcAfee, JHFitzpatrick, KTVan der Schyf, CJAllen, DD Molecular modeling studies on the active binding site of the blood-brain barrier choline transporter. Bioorg Med Chem Lett 14:3085-92 (2004)  
Target
Name:
Sodium- and chloride-dependent creatine transporter 1
Synonyms:
CHOT1 Creatine transporter SC6A8_RAT Sodium- and chloride-dependent creatine transporter 1 | Solute carrier family 6 member 8
Type:
PROTEIN
Mol. Mass.:
70632.63
Organism:
Rattus norvegicus
Description:
ChEMBL_49276
Residue:
635
  
Inhibitor
Name:
BDBM50147110
Synonyms:
CHEMBL104897 | Ethyl-trimethyl-ammonium
Type:
Small organic molecule
Emp. Form.:
C5H14N
Mol. Mass.:
88.1708
SMILES:
CC[N+](C)(C)C
: