Target
Extracellular calcium-sensing receptor
Ligand
BDBM50147700
Substrate
Meas. Tech.
ChEMBL_42943 (CHEMBL656309)
EC50
1300±n/a nM
Citation
 Kessler, AFaure, HPetrel, CRuat, MDauban, PDodd, RH N2-benzyl-N1-(1-(1-naphthyl)ethyl)-3-phenylpropane-1,2-diamines and conformationally restrained indole analogues: development of calindol as a new calcimimetic acting at the calcium sensing receptor. Bioorg Med Chem Lett 14:3345-9 (2004)  
Target
Name:
Extracellular calcium-sensing receptor
Synonyms:
CASR_RAT Casr Parathyroid Cell calcium-sensing receptor | Pcar1
Type:
PROTEIN
Mol. Mass.:
120858.46
Organism:
Rattus norvegicus
Description:
ChEMBL_750426
Residue:
1079
  
Inhibitor
Name:
BDBM50147700
Synonyms:
(1H-Indol-2-ylmethyl)-(1-naphthalen-1-yl-ethyl)-amine; hydrochloride | CHEMBL543875
Type:
Small organic molecule
Emp. Form.:
C21H20N2
Mol. Mass.:
300.3969
SMILES:
CC(NCc1cc2ccccc2[nH]1)c1cccc2ccccc12
: