Target
72 kDa type IV collagenase
Ligand
BDBM50148208
Substrate
Meas. Tech.
ChEMBL_104555 (CHEMBL718941)
IC50
0.26±n/a nM
Citation
 Reiter, LARobinson, RPMcClure, KFJones, CSReese, MRMitchell, PGOtterness, IGBliven, MLLiras, JCortina, SRDonahue, KMEskra, JDGriffiths, RJLame, MELopez-Anaya, AMartinelli, GJMcGahee, SMYocum, SALopresti-Morrow, LLTobiassen, LMVaughn-Bowser, ML Pyran-containing sulfonamide hydroxamic acids: potent MMP inhibitors that spare MMP-1. Bioorg Med Chem Lett 14:3389-95 (2004)  
Target
Name:
72 kDa type IV collagenase
Synonyms:
72 kDa gelatinase CLG4A Gelatinase A (MMP-2) MMP2_HUMAN Matrix metalloproteinase-2 (MMP 2) Matrix metalloproteinases 2 (MMP-2) | TBE-1
Type:
Enzyme
Mol. Mass.:
73870.36
Organism:
Homo sapiens (Human)
Description:
P08253
Residue:
660
  
Inhibitor
Name:
BDBM50148208
Synonyms:
3-[4-(4-Fluoro-phenoxy)-benzenesulfonylamino]-8-oxa-bicyclo[3.2.1]octane-3-carboxylic acid hydroxyamide | CHEMBL321633
Type:
Small organic molecule
Emp. Form.:
C20H21FN2O6S
Mol. Mass.:
436.454
SMILES:
ONC(=O)C1(CC2CCC(C1)O2)NS(=O)(=O)c1ccc(Oc2ccc(F)cc2)cc1
: