Target
Macrophage metalloelastase
Ligand
BDBM50148216
Substrate
Meas. Tech.
ChEMBL_106461 (CHEMBL719133)
IC50
0.24±n/a nM
Citation
 Reiter, LARobinson, RPMcClure, KFJones, CSReese, MRMitchell, PGOtterness, IGBliven, MLLiras, JCortina, SRDonahue, KMEskra, JDGriffiths, RJLame, MELopez-Anaya, AMartinelli, GJMcGahee, SMYocum, SALopresti-Morrow, LLTobiassen, LMVaughn-Bowser, ML Pyran-containing sulfonamide hydroxamic acids: potent MMP inhibitors that spare MMP-1. Bioorg Med Chem Lett 14:3389-95 (2004)  
Target
Name:
Macrophage metalloelastase
Synonyms:
HME MMP12_HUMAN Matrix metalloproteinase-12 (MMP 12) Matrix metalloproteinase-12 (MMP12) | Matrix metalloproteinases 12 (MMP-12)
Type:
Enzyme
Mol. Mass.:
54012.99
Organism:
Homo sapiens (Human)
Description:
P39900
Residue:
470
  
Inhibitor
Name:
BDBM50148216
Synonyms:
4-[4-(4-Fluoro-phenoxy)-benzenesulfonylamino]-tetrahydro-pyran-4-carboxylic acid hydroxyamide | CHEMBL111856
Type:
Small organic molecule
Emp. Form.:
C18H19FN2O6S
Mol. Mass.:
410.417
SMILES:
ONC(=O)C1(CCOCC1)NS(=O)(=O)c1ccc(Oc2ccc(F)cc2)cc1
: