Target
Collagenase 3
Ligand
BDBM50148230
Substrate
Meas. Tech.
ChEMBL_106600 (CHEMBL717437)
IC50
13±n/a nM
Citation
 Reiter, LARobinson, RPMcClure, KFJones, CSReese, MRMitchell, PGOtterness, IGBliven, MLLiras, JCortina, SRDonahue, KMEskra, JDGriffiths, RJLame, MELopez-Anaya, AMartinelli, GJMcGahee, SMYocum, SALopresti-Morrow, LLTobiassen, LMVaughn-Bowser, ML Pyran-containing sulfonamide hydroxamic acids: potent MMP inhibitors that spare MMP-1. Bioorg Med Chem Lett 14:3389-95 (2004)  
Target
Name:
Collagenase 3
Synonyms:
MMP-13 MMP13_HUMAN Matrix metalloproteinase-13 (MMP-13) | Matrix metalloproteinase-13 (MMP13)
Type:
Enzyme
Mol. Mass.:
53808.06
Organism:
Homo sapiens (Human)
Description:
P45452
Residue:
471
  
Inhibitor
Name:
BDBM50148230
Synonyms:
4-[4-(Pyridin-2-yloxy)-benzenesulfonylamino]-tetrahydro-pyran-4-carboxylic acid hydroxyamide | CHEMBL115666
Type:
Small organic molecule
Emp. Form.:
C17H19N3O6S
Mol. Mass.:
393.414
SMILES:
ONC(=O)C1(CCOCC1)NS(=O)(=O)c1ccc(Oc2ccccn2)cc1
: