Target
Sphingosine 1-phosphate receptor 3
Ligand
BDBM50148402
Substrate
Meas. Tech.
ChEBML_201331
IC50
1000±n/a nM
Citation
 Hale, JJDoherty, GToth, LLi, ZMills, SGHajdu, RAnn Keohane, CRosenbach, MMilligan, JShei, GJChrebet, GBergstrom, JCard, DRosen, HMandala, S The discovery of 3-(N-alkyl)aminopropylphosphonic acids as potent S1P receptor agonists. Bioorg Med Chem Lett 14:3495-9 (2004)  
Target
Name:
Sphingosine 1-phosphate receptor 3
Synonyms:
C9orf108 EDG3 S1P receptor 3 S1P3 S1PR3_HUMAN Sphingosine 1-phosphate receptor 3 (S1P3) | Sphingosine 1-phosphate receptor Edg-3
Type:
G Protein-Coupled Receptor (GPCR)
Mol. Mass.:
42278.13
Organism:
Homo sapiens (Human)
Description:
Q99500
Residue:
378
  
Inhibitor
Name:
BDBM50148402
Synonyms:
hydrogen (3-{[(4-nonylphenyl)methyl]amino}propyl)phosphonite
Type:
Small organic molecule
Emp. Form.:
C19H33NO2P
Mol. Mass.:
338.4451
SMILES:
CCCCCCCCCc1ccc(CNCCCP(O)[O-])cc1
: