Target
Prothrombin
Ligand
BDBM50148987
Substrate
Meas. Tech.
ChEBML_209231
Ki
16±n/a nM
Citation
 Lu, TMarkotan, TCoppo, FTomczuk, BCrysler, CEisennagel, SSpurlino, JGremminger, LSoll, RMGiardino, ECBone, R Oxyguanidines. Part 2: Discovery of a novel orally active thrombin inhibitor through structure-based drug design and parallel synthesis. Bioorg Med Chem Lett 14:3727-31 (2004)  
Target
Name:
Prothrombin
Synonyms:
Activation peptide fragment 1 Coagulation factor II Prothrombin precursor Thrombin heavy chain | Thrombin light chain
Type:
Protein
Mol. Mass.:
70029.57
Organism:
Homo sapiens (Human)
Description:
P00734
Residue:
622
  
Inhibitor
Name:
BDBM50148987
Synonyms:
CHEMBL125772 | Oxyguanidine derivative
Type:
Small organic molecule
Emp. Form.:
C19H29ClN4O3
Mol. Mass.:
396.912
SMILES:
CCCN(CC1CCC1)C(=O)c1cc(Cl)cc(OCCCONC(N)=N)c1
: