Target
Adenosine receptor A1
Ligand
BDBM50452003
Substrate
Meas. Tech.
ChEMBL_29574 (CHEMBL640040)
Ki
354±n/a nM
Citation
 Morrison, CFElzein, EJiang, BIbrahim, PNMarquart, TPalle, VShenk, KDVarkhedkar, VMaa, TWu, LWu, YZeng, DFong, ILustig, DLeung, KZablocki, JA Structure-affinity relationships of 5'-aromatic ethers and 5'-aromatic sulfides as partial A1 adenosine agonists, potential supraventricular anti-arrhythmic agents. Bioorg Med Chem Lett 14:3793-7 (2004)  
Target
Name:
Adenosine receptor A1
Synonyms:
A1 adenosine receptor ADENOSINE A1 ADENOSINE A1 low Adenosine A1 receptor | Adenosine Receptor A1
Type:
Enzyme Catalytic Domain
Mol. Mass.:
36501.39
Organism:
GUINEA PIG
Description:
ADENOSINE A1 ADORA1 GUINEA PIG::P47745
Residue:
326
  
Inhibitor
Name:
BDBM50452003
Synonyms:
CHEMBL609532
Type:
Small organic molecule
Emp. Form.:
C23H26N6O4S2
Mol. Mass.:
514.62
SMILES:
COc1ccc2sc(SC[C@H]3OC([C@H](O)[C@@H]3O)n3cnc4c(NC5CCCC5)ncnc34)nc2c1
: