Target
Lysozyme C-1
Ligand
BDBM79181
Substrate
Meas. Tech.
ChEBML_100187
IC50
9000±n/a nM
Citation
 Ko, HHWeng, JRTsao, LTYen, MHWang, JPLin, CN Anti-inflammatory flavonoids and pterocarpanoid from Crotalaria pallida and C. assamica. Bioorg Med Chem Lett 14:1011-4 (2004)  
Target
Name:
Lysozyme C-1
Synonyms:
LYSC1_RAT Lyz | Lyz1
Type:
PROTEIN
Mol. Mass.:
16739.00
Organism:
Rattus norvegicus
Description:
ChEMBL_12136
Residue:
148
  
Inhibitor
Name:
BDBM79181
Synonyms:
10-[3-(4-methyl-1-piperazinyl)propyl]-2-(trifluoromethyl)phenothiazine;hydrochloride 10-[3-(4-methylpiperazino)propyl]-2-(trifluoromethyl)phenothiazine;hydrochloride SMR000059133 TRIFLUOPERAZINE DIHYDROCHLORIDE US11542290, Compound Trifluoperazine cid_5566
Type:
Small organic molecule
Emp. Form.:
C21H24F3N3S
Mol. Mass.:
407.496
SMILES:
CN1CCN(CCCN2c3ccccc3Sc3ccc(cc23)C(F)(F)F)CC1
: