Target
High affinity nerve growth factor receptor
Ligand
BDBM50366932
Substrate
Meas. Tech.
ChEBML_210742
IC50
6±n/a nM
Citation
 Wood, ERKuyper, LPetrov, KGHunter, RNHarris, PALackey, K Discovery and in vitro evaluation of potent TrkA kinase inhibitors: oxindole and aza-oxindoles. Bioorg Med Chem Lett 14:953-7 (2004)  
Target
Name:
High affinity nerve growth factor receptor
Synonyms:
2.7.10.1 NTRK1 NTRK1_HUMAN Neurotrophic tyrosine kinase receptor type 1 Synonyms=MTC TRK1-transforming tyrosine kinase protein TRKA GN Tropomyosin alpha-3 chain/High affinity nerve growth factor receptor Tropomyosin-related kinase A (TrkA) Tyrosine kinase receptor (Trk) Tyrosine kinase receptor A (Trk A) Tyrosine kinase receptor A (TrkA) p140-TrkA
Type:
Mol. Mass.:
87498.18
Organism:
Homo sapiens (Human)
Description:
P04629
Residue:
796
  
Inhibitor
Name:
BDBM50366932
Synonyms:
CHEMBL1794058
Type:
Small organic molecule
Emp. Form.:
C16H15N3O3S
Mol. Mass.:
329.374
SMILES:
CS(=O)(=O)Nc1ccc(cc1)N=CC1C(=O)Nc2ccccc12
: