Target
Neuronal acetylcholine receptor subunit alpha-4/beta-4
Ligand
BDBM10759
Substrate
Meas. Tech.
ChEMBL_144016 (CHEMBL750431)
Ki
83±n/a nM
Citation
 Xiao, YBaydyuk, MWang, HPDavis, HEKellar, KJ Pharmacology of the agonist binding sites of rat neuronal nicotinic receptor subtypes expressed in HEK 293 cells. Bioorg Med Chem Lett 14:1845-8 (2004)  
Target
Name:
Neuronal acetylcholine receptor subunit alpha-4/beta-4
Synonyms:
Neuronal acetylcholine receptor protein alpha-4/beta-4 subunit nAChR subtypes alpha4 beta4
Type:
Mol. Mass.:
Description:
ASSAY_ID of EBI is 144014
Components:
This complex has 2 components.
Component 1
Name:
Neuronal acetylcholine receptor subunit alpha-4
Synonyms:
ACHA4_RAT Cholinergic, Nicotinic Alpha4Beta2 Chrna4 Neuronal acetylcholine receptor (alpha4beta2 nAChR) Neuronal acetylcholine receptor subunit alpha 4 beta 2 | Neuronal acetylcholine receptor subunit alpha-4
Type:
Enzyme
Mol. Mass.:
70196.44
Organism:
Rattus norvegicus (Rat)
Description:
P09483
Residue:
630
  
Component 2
Name:
Neuronal acetylcholine receptor subunit beta-4
Synonyms:
ACHB4_RAT Chrnb4 Neuronal acetylcholine receptor non-alpha-2 chain | Neuronal acetylcholine receptor protein beta-4 subunit
Type:
Enzyme
Mol. Mass.:
55863.89
Organism:
Rattus norvegicus (Rat)
Description:
P12392
Residue:
495
  
Inhibitor
Name:
BDBM10759
Synonyms:
2-acetoxyethyl(trimethyl)ammonium;bromide CHEMBL667 [2-(acetyloxy)ethyl]trimethylazanium acetylcholine chloride | cid_6060
Type:
Small Organic Molecule
Emp. Form.:
C7H16NO2
Mol. Mass.:
146.2069
SMILES:
CC(=O)OCC[N+](C)(C)C
: