Target
Neuronal acetylcholine receptor subunit alpha-2/beta-2
Ligand
BDBM50049750
Substrate
Meas. Tech.
ChEMBL_143227 (CHEMBL750088)
Ki
0.074000±n/a nM
Citation
 Xiao, YBaydyuk, MWang, HPDavis, HEKellar, KJ Pharmacology of the agonist binding sites of rat neuronal nicotinic receptor subtypes expressed in HEK 293 cells. Bioorg Med Chem Lett 14:1845-8 (2004)  
Target
Name:
Neuronal acetylcholine receptor subunit alpha-2/beta-2
Synonyms:
Neuronal acetylcholine receptor protein alpha-2/beta-2 subunit nAChR subtypes alpha2 beta2
Type:
Mol. Mass.:
Description:
ASSAY_ID of EBI is 143226
Components:
This complex has 2 components.
Component 1
Name:
Neuronal acetylcholine receptor subunit alpha-2
Synonyms:
ACHA2_RAT Cholinergic, Nicotinic Alpha2Beta2 Chrna2
Type:
Enzyme
Mol. Mass.:
58597.25
Organism:
Rattus norvegicus (Rat)
Description:
P12389
Residue:
511
  
Component 2
Name:
Neuronal acetylcholine receptor subunit beta-2
Synonyms:
ACHB2_RAT Chrnb2 Neuronal acetylcholine receptor non-alpha-1 chain
Type:
Enzyme
Mol. Mass.:
56910.32
Organism:
Rattus norvegicus (Rat)
Description:
P12390
Residue:
500
  
Inhibitor
Name:
BDBM50049750
Synonyms:
(S)-3-(azetidin-2-ylmethoxy)pyridine A-159470 CHEMBL59986
Type:
Small organic molecule
Emp. Form.:
C9H12N2O
Mol. Mass.:
164.2044
SMILES:
C(Oc1cccnc1)[C@@H]1CCN1
: