Target
Neuronal acetylcholine receptor subunit alpha-4/beta-2
Ligand
BDBM10759
Substrate
Meas. Tech.
ChEMBL_143730 (CHEMBL756126)
Ki
45±n/a nM
Citation
 Xiao, YBaydyuk, MWang, HPDavis, HEKellar, KJ Pharmacology of the agonist binding sites of rat neuronal nicotinic receptor subtypes expressed in HEK 293 cells. Bioorg Med Chem Lett 14:1845-8 (2004)  
Target
Name:
Neuronal acetylcholine receptor subunit alpha-4/beta-2
Synonyms:
Neuronal acetylcholine receptor alpha4/beta2 Neuronal acetylcholine receptor; alpha4/beta2
Type:
Mol. Mass.:
Description:
Components:
This complex has 0 components.
Component 1
Name:
Neuronal acetylcholine receptor subunit alpha-4
Synonyms:
ACHA4_RAT Cholinergic, Nicotinic Alpha4Beta2 Chrna4 Neuronal acetylcholine receptor (alpha4beta2 nAChR) Neuronal acetylcholine receptor subunit alpha 4 beta 2 | Neuronal acetylcholine receptor subunit alpha-4
Type:
Enzyme
Mol. Mass.:
70196.44
Organism:
Rattus norvegicus (Rat)
Description:
P09483
Residue:
630
  
Component 2
Name:
Neuronal acetylcholine receptor subunit beta-2
Synonyms:
ACHB2_RAT Chrnb2 Neuronal acetylcholine receptor non-alpha-1 chain
Type:
Enzyme
Mol. Mass.:
56910.32
Organism:
Rattus norvegicus (Rat)
Description:
P12390
Residue:
500
  
Inhibitor
Name:
BDBM10759
Synonyms:
2-acetoxyethyl(trimethyl)ammonium;bromide CHEMBL667 [2-(acetyloxy)ethyl]trimethylazanium acetylcholine chloride | cid_6060
Type:
Small Organic Molecule
Emp. Form.:
C7H16NO2
Mol. Mass.:
146.2069
SMILES:
CC(=O)OCC[N+](C)(C)C
: