Target
Glucocorticoid receptor
Ligand
BDBM50144172
Substrate
Meas. Tech.
ChEBML_71109
IC50
210±n/a nM
Citation
 Akritopoulou-Zanze, IPatel, JRHartandi, KBrenneman, JWinn, MPratt, JKGrynfarb, MGoos-Nisson, AVon Geldern, TWKym, PR Synthesis and biological evaluation of novel, selective, nonsteroidal glucocorticoid receptor antagonists. Bioorg Med Chem Lett 14:2079-82 (2004)  
Target
Name:
Glucocorticoid receptor
Synonyms:
GCR_HUMAN GRL Glucocorticoid receptor (GRFP) Nuclear receptor subfamily 3 group C member 1
Type:
Enzyme
Mol. Mass.:
85656.87
Organism:
Homo sapiens (Human)
Description:
P04150
Residue:
777
  
Inhibitor
Name:
BDBM50144172
Synonyms:
CHEMBL65074 | N-(1-Methoxy-6-phenyl-6H-benzo[c]chromen-8-yl)-N-methyl-methanesulfonamide
Type:
Small organic molecule
Emp. Form.:
C22H21NO4S
Mol. Mass.:
395.471
SMILES:
COc1cccc2OC(c3ccccc3)c3cc(ccc3-c12)N(C)S(C)(=O)=O
: