Target
Glucocorticoid receptor
Ligand
BDBM50144153
Substrate
Meas. Tech.
ChEMBL_71101 (CHEMBL679613)
IC50
2±n/a nM
Citation
 Akritopoulou-Zanze, IPatel, JRHartandi, KBrenneman, JWinn, MPratt, JKGrynfarb, MGoos-Nisson, AVon Geldern, TWKym, PR Synthesis and biological evaluation of novel, selective, nonsteroidal glucocorticoid receptor antagonists. Bioorg Med Chem Lett 14:2079-82 (2004)  
Target
Name:
Glucocorticoid receptor
Synonyms:
GCR_HUMAN GRL Glucocorticoid receptor (GRFP) Nuclear receptor subfamily 3 group C member 1
Type:
Enzyme
Mol. Mass.:
85656.87
Organism:
Homo sapiens (Human)
Description:
P04150
Residue:
777
  
Inhibitor
Name:
BDBM50144153
Synonyms:
CHEMBL293452 | N-[6-(3,5-Dimethyl-phenyl)-1-methoxy-6H-benzo[c]chromen-8-yl]-methanesulfonamide
Type:
Small organic molecule
Emp. Form.:
C23H23NO4S
Mol. Mass.:
409.498
SMILES:
COc1cccc2OC(c3cc(C)cc(C)c3)c3cc(NS(C)(=O)=O)ccc3-c12
: