Target
Glucocorticoid receptor
Ligand
BDBM50144163
Substrate
Meas. Tech.
ChEMBL_71107 (CHEMBL679619)
IC50
1204±n/a nM
Citation
 Akritopoulou-Zanze, IPatel, JRHartandi, KBrenneman, JWinn, MPratt, JKGrynfarb, MGoos-Nisson, AVon Geldern, TWKym, PR Synthesis and biological evaluation of novel, selective, nonsteroidal glucocorticoid receptor antagonists. Bioorg Med Chem Lett 14:2079-82 (2004)  
Target
Name:
Glucocorticoid receptor
Synonyms:
GCR_HUMAN GRL Glucocorticoid receptor (GRFP) Nuclear receptor subfamily 3 group C member 1
Type:
Enzyme
Mol. Mass.:
85656.87
Organism:
Homo sapiens (Human)
Description:
P04150
Residue:
777
  
Inhibitor
Name:
BDBM50144163
Synonyms:
8-Methanesulfonylamino-6-phenyl-6H-benzo[c]chromene-1-carboxylic acid methyl ester | CHEMBL294112
Type:
Small organic molecule
Emp. Form.:
C22H19NO5S
Mol. Mass.:
409.455
SMILES:
COC(=O)c1cccc2OC(c3ccccc3)c3cc(NS(C)(=O)=O)ccc3-c12
: