Target
Mineralocorticoid receptor
Ligand
BDBM50144150
Substrate
Meas. Tech.
ChEBML_123675
IC50
2252±n/a nM
Citation
 Akritopoulou-Zanze, IPatel, JRHartandi, KBrenneman, JWinn, MPratt, JKGrynfarb, MGoos-Nisson, AVon Geldern, TWKym, PR Synthesis and biological evaluation of novel, selective, nonsteroidal glucocorticoid receptor antagonists. Bioorg Med Chem Lett 14:2079-82 (2004)  
Target
Name:
Mineralocorticoid receptor
Synonyms:
MCR MLR NR3C2 | Nuclear receptor subfamily 3 group C member 2
Type:
Enzyme
Mol. Mass.:
107076.42
Organism:
Homo sapiens (Human)
Description:
P08235
Residue:
984
  
Inhibitor
Name:
BDBM50144150
Synonyms:
CHEMBL293388 | N-(1-Methoxy-6-thiophen-2-yl-6H-benzo[c]chromen-8-yl)-methanesulfonamide
Type:
Small organic molecule
Emp. Form.:
C19H17NO4S2
Mol. Mass.:
387.473
SMILES:
COc1cccc2OC(c3cccs3)c3cc(NS(C)(=O)=O)ccc3-c12
: