Target
Estrogen receptor
Ligand
BDBM50144155
Substrate
Meas. Tech.
ChEBML_67369
IC50
>10000±n/a nM
Citation
 Akritopoulou-Zanze, IPatel, JRHartandi, KBrenneman, JWinn, MPratt, JKGrynfarb, MGoos-Nisson, AVon Geldern, TWKym, PR Synthesis and biological evaluation of novel, selective, nonsteroidal glucocorticoid receptor antagonists. Bioorg Med Chem Lett 14:2079-82 (2004)  
Target
Name:
Estrogen receptor
Synonyms:
ER ESR ESR1_HUMAN Estrogen receptor Estrogen receptor (ER-alpha) Estrogen receptor alpha (ER) Nuclear receptor subfamily 3 group A member 1
Type:
Protein
Mol. Mass.:
66230.44
Organism:
Homo sapiens (Human)
Description:
P03372
Residue:
595
  
Inhibitor
Name:
BDBM50144155
Synonyms:
CHEMBL66598 | N-(1-Ethoxy-6-phenyl-6H-benzo[c]chromen-8-yl)-methanesulfonamide
Type:
Small organic molecule
Emp. Form.:
C22H21NO4S
Mol. Mass.:
395.471
SMILES:
CCOc1cccc2OC(c3ccccc3)c3cc(NS(C)(=O)=O)ccc3-c12
: