Target
Glucocorticoid receptor
Ligand
BDBM50144184
Substrate
Meas. Tech.
ChEMBL_71244 (CHEMBL683340)
IC50
910±n/a nM
Citation
 Akritopoulou-Zanze, IPatel, JRHartandi, KBrenneman, JWinn, MPratt, JKGrynfarb, MGoos-Nisson, AVon Geldern, TWKym, PR Synthesis and biological evaluation of novel, selective, nonsteroidal glucocorticoid receptor antagonists. Bioorg Med Chem Lett 14:2079-82 (2004)  
Target
Name:
Glucocorticoid receptor
Synonyms:
GCR_HUMAN GRL Glucocorticoid receptor (GRFP) Nuclear receptor subfamily 3 group C member 1
Type:
Enzyme
Mol. Mass.:
85656.87
Organism:
Homo sapiens (Human)
Description:
P04150
Residue:
777
  
Inhibitor
Name:
BDBM50144184
Synonyms:
Benzyl-(1-methoxy-6-phenyl-6H-benzo[c]chromen-8-yl)-amine | CHEMBL305393
Type:
Small organic molecule
Emp. Form.:
C27H23NO2
Mol. Mass.:
393.477
SMILES:
COc1cccc2OC(c3ccccc3)c3cc(NCc4ccccc4)ccc3-c12
: