Target
Carbonic anhydrase 4
Ligand
BDBM50141773
Substrate
Meas. Tech.
ChEBML_45430
Ki
92±n/a nM
Citation
 Pastorekova, SCasini, AScozzafava, AVullo, DPastorek, JSupuran, CT Carbonic anhydrase inhibitors: the first selective, membrane-impermeant inhibitors targeting the tumor-associated isozyme IX. Bioorg Med Chem Lett 14:869-73 (2004)  
Target
Name:
Carbonic anhydrase 4
Synonyms:
CA-IV CAH4_BOVIN Carbonic Anhydrase IV Carbonic anhydrase 4
Type:
Enzyme
Mol. Mass.:
35152.74
Organism:
Bos taurus (bovine)
Description:
Bovine isozyme, isolated from lung microsomes
Residue:
312
  
Inhibitor
Name:
BDBM50141773
Synonyms:
2,4,6-Trimethyl-1-(4-sulfamoyl-benzyl)-pyridinium; perchlorate | CHEMBL170938
Type:
Small organic molecule
Emp. Form.:
C15H19N2O2S
Mol. Mass.:
291.388
SMILES:
Cc1cc(C)[n+](Cc2ccc(cc2)S(N)(=O)=O)c(C)c1
: