Target
Carbonic anhydrase 2
Ligand
BDBM50141801
Substrate
Meas. Tech.
ChEBML_45231
Ki
103±n/a nM
Citation
 Pastorekova, SCasini, AScozzafava, AVullo, DPastorek, JSupuran, CT Carbonic anhydrase inhibitors: the first selective, membrane-impermeant inhibitors targeting the tumor-associated isozyme IX. Bioorg Med Chem Lett 14:869-73 (2004)  
Target
Name:
Carbonic anhydrase 2
Synonyms:
CA-II CAC Carbonate dehydratase II Carbonic anhydrase 2 (CA-II) Carbonic anhydrase C Carbonic anhydrase II (CA-II) Carbonic anhydrase II (hCA II) | Carbonic anhydrase isoenzyme II (hCA II)
Type:
Enzyme
Mol. Mass.:
29250.71
Organism:
Homo sapiens (Human)
Description:
P00918
Residue:
260
  
Inhibitor
Name:
BDBM50141801
Synonyms:
2-Methyl-4,6-diphenyl-1-[2-(4-sulfamoyl-phenyl)-ethyl]-pyridinium; perchlorate | CHEMBL355026
Type:
Small organic molecule
Emp. Form.:
C26H25N2O2S
Mol. Mass.:
429.553
SMILES:
Cc1cc(cc(-c2ccccc2)[n+]1CCc1ccc(cc1)S(N)(=O)=O)-c1ccccc1
: