Target
Choline O-acetyltransferase
Ligand
BDBM50029028
Substrate
Meas. Tech.
ChEMBL_49269 (CHEMBL662976)
Ki
800±n/a nM
Citation
 Mautner, HGMerrill, RECurrier, SFHarvey, G Interaction of aromatic dyes with the coenzyme A binding site of choline acetyltransferase. J Med Chem 24:1534-7 (1982)  
Target
Name:
Choline O-acetyltransferase
Synonyms:
CHAT CLAT_HUMAN Choline acetylase
Type:
PROTEIN
Mol. Mass.:
82561.12
Organism:
Homo sapiens (Human)
Description:
ChEMBL_49268
Residue:
748
  
Inhibitor
Name:
BDBM50029028
Synonyms:
(cibacron blue,para isomer)1-Amino-4-{4-[4-chloro-6-(4-sulfo-phenylamino)-[1,3,5]triazin-2-ylamino]-3-sulfo-phenylamino}-9,10-dioxo-9,10-dihydro-anthracene-2-sulfonic acid
Type:
Small organic molecule
Emp. Form.:
C29H17ClN7O11S3
Mol. Mass.:
771.135
SMILES:
Nc1c(cc(Nc2ccc(Nc3nc(Cl)nc(Nc4ccc(cc4)S([O-])(=O)=O)n3)c(c2)S([O-])(=O)=O)c2C(=O)c3ccccc3C(=O)c12)S([O-])(=O)=O
: