Target
Cytidine deaminase
Ligand
BDBM50367034
Substrate
Meas. Tech.
ChEBML_52526
Ki
70±n/a nM
Citation
 Liu, PSMarquez, VEDriscoll, JSFuller, RWMcCormack, JJ Cyclic urea nucleosides. Cytidine deaminase activity as a function of aglycon ring size. J Med Chem 24:662-6 (1981)  
Target
Name:
Cytidine deaminase
Synonyms:
CDD_MOUSE Cdd | Cytidine aminohydrolase
Type:
PROTEIN
Mol. Mass.:
16129.75
Organism:
Mus musculus
Description:
ChEMBL_52531
Residue:
146
  
Inhibitor
Name:
BDBM50367034
Synonyms:
CHEMBL610997
Type:
Small organic molecule
Emp. Form.:
C10H16N2O5
Mol. Mass.:
244.2444
SMILES:
OC[C@H]1OC([C@H](O)[C@@H]1O)N1CC=CCNC1=O
: